محرک (ماده یا دارو)
type: Concept
broader: ماده مخدر
preferred label: Stimulant @en
scope note: اصطلاحی كلی برای طبقه‌ای از مواد یا داروهای روانگردان كه ایجاد تحرك و بیداری می‌كنند، مانند آمفتامین یا كافئین.

ماده مخدر
type: Concept
narrower: محرک (ماده یا دارو)
preferred label: Drug @en