ملی
type: Concept
preferred label: National @en
related: برنامه درسی ملی

برنامه درسی ملی
type: Concept
broader: برنامه آموزشی
preferred label: National curriculum @en
related: ملی
scope note: برنامه آموزشی تمام رشته‌ها یا درسهایی كه در سطح ملی یا مدارس دولتی ارائه می‌شود.

برنامه آموزشی
type: Concept
narrower: برنامه درسی ملی
preferred label: Educational programme @en