ترخیص از بیمارستان
type: Concept
preferred label: Hospital discharge @en
related: مراقبت بعدی

توانبخشی
type: Concept
preferred label: Rehabilitation @en
related: مراقبت بعدی

مراقبت بعدی
type: Concept
preferred label: Aftercare @en
related: ترخیص از بیمارستان
related: توانبخشی
scope note: رهنمود به بیماران برای انجام كارهای بعد از درمان پزشكی یا مراقبت از بیماران توسط متخصصان بعد از درمان پزشكی.