کمکهای اولیه
type: Concept
preferred label: First aid @en
related: احیا

احیا
type: Concept
alternative label: به‌هوش آوري
preferred label: Resuscitation @en
related: کمکهای اولیه
scope note: دوباره جان‌دادن یا زنده كردن و یا جریان عادی تنفس را به شخص برگرداندن.