اثر
preferred label: Effect @en
type: Concept
related: علیت

علیت
scope note: نسبت میان دو رویداد یا دو حالت از امور كه در آن، یكی موجب پدید آمدن یا ایجاد آن دیگری است.
related: اثر
preferred label: Causality @en
type: Concept