روش پژوهش
preferred label: Research method @en
type: Concept
narrower: مطالعه موردی

مطالعه موردی
scope note: تجزیه و تحلیل كامل یك شخص یا گروه به عنوان الگوی پزشكی، روانی، بهداشتی، اجتماعی و جز اینها. یا تجزیه و تحلیل یك موضوع واحد كه ممكن است فرد، خانواده، نهاد، انجمن یا جامعه باشد.
broader: روش پژوهش
preferred label: Case study @en
type: Concept