روش پژوهش
preferred label: Research method @en
type: Concept
narrower: روش دلفی

روش دلفی
scope note: تكرار گردش پرسشها و پاسخها در یك موضوع خاص در بین گروهی از كارشناسان كه به صورت پیشرونده درهر دور گردش، پاسخها مورد پالایش قرار می‌گیرد و معمولا سعی می‌شود تا هویت شركت‌كنندگان بر یكدیگر آشكار نگردد. هدف از این كار، دست یافتن به یك قضاوت هماهنگ در باره موضوع یا مسئله‌ای است.
broader: روش پژوهش
preferred label: Delphi method @en
type: Concept