روش پژوهش
preferred label: Research method @en
type: Concept
narrower: فرا‌ تحلیل

فرا‌ تحلیل
alternative label: مابعد تحليل
scope note: فرایند به‌كارگیری روشهای آماری برای تركیب كردن نتیجه مطالعات متفاوت.
broader: روش پژوهش
preferred label: Meta-analysis @en
type: Concept