مشاور
scope note: شخصی كه به دیگران در حل مشكلات و مسائل گوناگون كمك می‌كند.
related: مشاوره
broader: مددکار اجتماعی
preferred label: Counsellor @en
type: Concept

مشاوره
preferred label: Counselling @en
type: Concept
related: مشاور

مددکار اجتماعی
preferred label: Social worker @en
type: Concept
narrower: مشاور