بیش‌فعالی
preferred label: Hyperactivity @en
type: Concept
related: اختلال بیش‌فعالی همراه با کاستی توجه

اختلال رفتاری
preferred label: Behavioural disorder @en
type: Concept
narrower: اختلال بیش‌فعالی همراه با کاستی توجه

اختلال بیش‌فعالی همراه با کاستی توجه
alternative label: كمترين آسيب مغزي موثر
scope note: مجموعه‌ای از علائم است كه با محدودیت میزان توجه كه به وضعیت تمركز، رفتار خلق‌الساعه و بیش‌فعالی منتهی می‌شود، مشخص است. شیوع این اختلال در پسرها بیشتر از دخترها است.چنین كودكانی معمولا از آرام نشستن ناتوان هستند، در بازیهای گروهی تاب رعایت نوبت را ندارند، قبل از اینكه پرسش تمام شود پاسخهایی می‌دهند، حواسشان به سهولت پرت می‌شود، زیاد حرف می‌زنند و در كار دیگران مداخله می‌كنند.
related: بیش‌فعالی
broader: اختلال رفتاری
preferred label: Attention deficit and hyperactive disorder @en
type: Concept