ارزشیابی
preferred label: Evaluation @en
type: Concept
related: پایش

پایش
scope note: عملكرد و تجزیه و تحلیل اندازه‌گیریهای رایج با هدف شناسایی تغییرهای محیط زیست و وضعیت سلامت جمعیتها یا بازبینی مستمر اجرای یك فعالیت برای اطمینان از اینكه توزیع ستاده‌ها، برنامه‌های كاری، بازده‌های مورد نظر و سایر اقدامات لازم مطابق برنامه پیش می‌رود.
related: ارزشیابی
preferred label: Monitoring @en
type: Concept