ارزش
preferred label: Value @en
type: Concept
related: انگیزش

تقویت
preferred label: Reinforcement @en
type: Concept
related: انگیزش

انگیزش
scope note: تحریك، كنترل و راهنمایی فعالیت فرد به سوی هدف معین.
related: ارزش
related: تقویت
preferred label: Motivation @en
type: Concept