پزشکی عمومی
preferred label: General practice @en
type: Concept
related: پذیرنده پزشکی عمومی

پذیرنده پزشکی عمومی
alternative label: پذيرنده پزشكي
scope note: متصدی پذیرش بیمار پزشكی عمومی كه نقش مهمی در تعیین اولویت درمان بیماران دارد كه یكی از مهمترین موارد آن، شناسایی بیمارانی است كه به مراقبت فوری و بموقع نیاز دارند.
related: پزشکی عمومی
preferred label: General practice receptionist @en
type: Concept