تزریق مشترک
alternative label: مبادله سوزن سرنگ (اعتياد)
scope note: استفاده از یك سوزن سرنگ برای تزریق به بیش از یك فرد كه معمولا افراد معتاد مرتكب می‌شوند. اخیرا وزارت بهداشت برای جلوگیری از سرایت بیماری ایدز و مقابله با بیماریهای واگیر و خطرناك، سرنگ و سوزن و سایر اشیاء مورد استفاده شخصی معتادان و مبتلایان به ایدز و هپاتیت را بطور رایگان در اختیار آنها قرار می‌دهد.
related: ماده مخدر
preferred label: Needle exchange @en
type: Concept

ماده مخدر
preferred label: Drug @en
type: Concept
related: تزریق مشترک