راهبرد
alternative label: استراتژي
scope note: روش یا سیاست كلی برای نیل به هدفهای معین.
related: برنامه‌ریزی
preferred label: Strategy @en
type: Concept

برنامه‌ریزی
preferred label: Planning @en
type: Concept
related: راهبرد