مدرسه
preferred label: School @en
type: Concept
related: انجمن اولیا و مربیان

انجمن اولیا و مربیان
scope note: جلسه یا نشست اولیا و مربیان مدارس برای تبادل نظر در مورد وضعیت تحصیلی و مسائل تربیتی دانش‌آموزان.
related: مدرسه
related: والدین
preferred label: Parents' evening @en
type: Concept

والدین
preferred label: Parents @en
type: Concept
related: انجمن اولیا و مربیان