پویایی‌شناسی گروه
preferred label: Group dynamics @en
type: Concept
related: فشار همگنان

فشار همگنان
scope note: اعمال فشار از طرف همگنان برای رفتار یا سلوك كردن مشابه رفتار آنها یا شیوه‌هایی كه مورد قبول آنها است.
related: آموزش همگنان
related: پویایی‌شناسی گروه
preferred label: Peer pressure @en
type: Concept

آموزش همگنان
preferred label: Peer education @en
type: Concept
related: فشار همگنان