مراقبت پیش از زایمان
preferred label: Antenatal care @en
type: Concept
related: تمرین پیش از زایمان

تمرین پیش از زایمان
alternative label: تمرين پيش از تولد
scope note: كار و فعالیت و تمرینهای متعادل و آموزشهای لازم پیش از وضع حمل برای زنان آبستن.
related: مراقبت پیش از زایمان
broader: تمرین
preferred label: Antenatal exercise @en
type: Concept

تمرین
preferred label: Exercise @en
type: Concept
narrower: تمرین پیش از زایمان