رابطه مراقب بهداشتی- مراجع
preferred label: Health care worker-client relation @en
type: Concept
related: رازداری

رازداری
alternative label: محرمانگي
scope note: محرمانه ماندن اطلاعات، اجبار به فاش نساختن اطلاعات، حق افراد برای ندادن اطلاعاتشان به دیگران. اطلاعات پرونده‌های درمانی و بهداشتی، ثبت موارد بیماری و سایر پرونده‌های اطلاعات و پایگاه اطلاعات به‌طور كلی محرمانه‌اند و برای دسترسی به آنها باید با رضایت آگاهانه و اجازه شخصی باشد كه پرونده مربوط به اوست.
related: رابطه مراقب بهداشتی- مراجع
preferred label: Confidentiality @en
type: Concept