خودبیمارانگاری
alternative label: توهم بيمار شدن
scope note: بیماری عصبی كه ویژگی آن، نگرانی افراطی فرد در مورد سلامت خودش است، در صورتی كه هیچگونه دلیل بدنی و پزشكی كافی برای این نگرانی وجود ندارد.
related: رفتار ایام بیماری
related: ترس
preferred label: Hypochondria @en
type: Concept

رفتار ایام بیماری
preferred label: Sickness behaviour @en
type: Concept
related: خودبیمارانگاری

ترس
preferred label: Fear @en
type: Concept
related: خودبیمارانگاری