مدرسه گریزی
alternative label: گريز از مدرسه
scope note: غیبت عمدی دانش‌آموز از مدرسه، بدون اطلاع و موافقت خانواده‌اش و بدون اینكه عذر موجهی داشته باشد.
related: کودک خیابانی
preferred label: Truancy @en
type: Concept

کودک خیابانی
preferred label: Street child @en
type: Concept
related: مدرسه گریزی