بازداری
alternative label: منع
scope note: جلوگیری از یك فعالیت، بویژه فعالیت ذهنی و عاطفی.
related: شرم
preferred label: Inhibition @en
type: Concept

شرم
preferred label: Shame @en
type: Concept
related: بازداری