روش پژوهش
preferred label: Research method @en
type: Concept
related: اعتبار (صحت)

اعتبار (صحت)
scope note: كیفیت بنیانگذاری حقیقت یا قانون. ویژگی یك عقیده یا استنتاج كه به علت هماهنگی با اصول منطقی، معتبر شناخته می‌شود.
related: ارزشیابی
related: روش پژوهش
preferred label: Validity @en
type: Concept

ارزشیابی
preferred label: Evaluation @en
type: Concept
related: اعتبار (صحت)