حرفه
scope note: برای توصیف حرفه، ویژگیهای زیر را برشمرده‌اند: 1- استفاده از مهارتهای مبتنی بر معلومات نظری. 2- وجود آموزش در این مهارتها. 3- تضمین صلاحیت اهل حرفه به وسیله آزمونها. 4- وجود ضوابط رفتاری كه تقوای صنفی افراد حرفه‌ای را تضمین می‌كند. 5- انجام خدمات سودمند برای مردم. 6- وجود اتحادیه كه اعضای هر حرفه را در خود متشكل كند.
related: کار تخصصی
related: شرح وضعیت حرفه‌ای
preferred label: Profession @en
type: Concept

کار تخصصی
preferred label: Professional practice @en
type: Concept
related: حرفه

شرح وضعیت حرفه‌ای
preferred label: Professional profile @en
type: Concept
related: حرفه