کارکنان حرفه‌ای
preferred label: Professional personnel @en
type: Concept
related: توسعه حرفه‌ای

توسعه
preferred label: Development @en
type: Concept
narrower: توسعه حرفه‌ای

توسعه حرفه‌ای
alternative label: توسعه شغلي
scope note: فرایند توسعه و آموزش حرفه‌ای و آگاهی، فهم، درك و شناخت شخص از جایگاه خود در دنیای كار.
related: کارکنان حرفه‌ای
broader: توسعه
preferred label: Career development @en
type: Concept