مخملک
alternative label: تب مخملك
scope note: بیماری عفونی واگیر كه معمولا در كودكی بروز می‌كند و از راه سرفه یا شیر آلوده انتقال می‌یابد. علائم آن عبارتند از تب، بدحالی، گلو درد و بثورات قرمز رنگ گسترده از زیر بغل و كشاله ران تا گردن، سینه و پشت و دست و پا و زبان.
broader: بیماری دوران کودکی
preferred label: Scarlet fever @en
type: Concept

بیماری دوران کودکی
preferred label: Childhood disease @en
type: Concept
narrower: مخملک