تبخال تناسلی
preferred label: Genital herpes @en
type: Concept
broader: تبخال

بیماری واگیر
preferred label: Communicable disease @en
type: Concept
narrower: تبخال

تبخال
scope note: التهاب پوست ناشی از ویروسها كه با مجموعه‌ای از تاولهای كوچك مشخص می‌شود.
narrower: تبخال تناسلی
broader: بیماری واگیر
preferred label: Herpes @en
type: Concept