کلامیدیا
scope note: كلامیدیاها جانداران بیماریزایی هستند كه به عنوان باكتریهای گرم منفی طبقه‌بندی شده‌اند. عفونتهای كلامیدیایی از جمله موجب بروز بیماری در دستگاه تناسلی می‌شود. كلامیدیاها به تتراسیكلین و اریترومایسین حساس هستند.
broader: بیماری آمیزشی
preferred label: Chlamydia @en
type: Concept

بیماری آمیزشی
preferred label: Sexually transmitted disease @en
type: Concept
narrower: کلامیدیا