بیماری لایم
scope note: اولین بار در سال 1975 در مزرعه لایم واقع در ایالت كانكتی‌كت آمریكای شمالی بروز كرد. بیماری لایم با نوعی ضایعه پوستی ویژه موسوم به اریتم مزمن مهاجر همراه با تب و لرز ، سردرد، سفتی عضلات گردن و درد عضلانی شروع می‌شود و سپس تورم مفصلی به‌وجود می‌آید. ضایعه پوستی در محل گزش نوعی كنه ظاهر می‌شود.
broader: بیماری مشترک انسان و حیوان
preferred label: Lyme disease @en
type: Concept

بیماری مشترک انسان و حیوان
preferred label: Zoonosis @en
type: Concept
narrower: بیماری لایم