نشانه بیماری
preferred label: Symptom @en
type: Concept
related: یبوست

اختلال لوله گوارش
preferred label: Digestive tract disorder @en
type: Concept
narrower: یبوست

یبوست
scope note: خشكی مزاج یا سفتی و كم‌آبی مدفوع. از جمله عوامل آن: فشارهای روانی و عصبی، استفاده از مسهل و داروهای ملین برای مدت طولانی، عادت غذایی فرد (مثل مصرف غذاهای پركالری و كاهش مصرف غذاهای فیبردار)، كمبود مصرف ویتامینهای گروه ب، نوشیدن كم مایعات و سستی حركات موجی شكل روده است.
related: نشانه بیماری
broader: اختلال لوله گوارش
preferred label: Constipation @en
type: Concept