بیماری کروتسفلد- جاکوب
alternative label: بيماري ژاكوب- كروتزفلد
scope note: اسكلروز كاذب اسپاسمی كه در سنین میانی و اواخر عمر عارض می‌شود و با استحاله قسمتی از سیستمهای پیرامیدال (هرمی) و اكستراپیرامیدال (برون هرمی) مغز مشخص می‌گردد.
broader: بیماری مغزی
preferred label: Creutzfeldt Jacob disease @en
type: Concept

بیماری مغزی
preferred label: Brain disease @en
type: Concept
narrower: بیماری کروتسفلد- جاکوب