پسوریازیس
alternative label: صدفك
scope note: بیماری مزمن پوستی كه با لكه‌های سرخ نقره فام در سینه، زانو و بازوها همراه است.
broader: بیماری پوست
preferred label: Psoriasis @en
type: Concept

بیماری پوست
preferred label: Skin disease @en
type: Concept
narrower: پسوریازیس