حشیش
alternative label: ماري‌جوانا
scope note: گیاه - ماده شاهدانه كه منبع بسیاری از مواد مخدر است. كانابیس هم به معنی گیاه شاهدانه (گیاه زراعی یكساله دارای ریشه عمیق و قائم با ساقه‌ای تا طول 4 متر) است و هم شامل نامهای عامیانه فراورده‌های آن از جمله ماری‌جوانا (گراس، بنگ، علف، دوا)‌، حشیش، روغن حشیش (روغن علف، روغن عسل) و چرس است. مسمومیت و یا استعمال آنها یادگیری و عملكرد شخص را مختل می‌كند و حافظه كوتاه مدت را تحت تاثیر قرار می‌دهد.
broader: ماده مخدر
preferred label: Cannabis @en
type: Concept

ماده مخدر
preferred label: Drug @en
type: Concept
narrower: حشیش