لیزرژیک اسید دی‌اتیل‌آمید
alternative label: ليسرژيك اسيد دي‌اتيل‌آميد
scope note: تركیبی كه از آن به عنوان ماده ایجادكننده علائم روان‌پریشی استفاده می‌كنند. این ماده توهم‌زا به سلامت جسمی و روانی فرد استفاده‌كننده به شدت آسیب می‌رساند.
broader: ماده مخدر
preferred label: Lysergic acid diethylamide @en
type: Concept

ماده مخدر
preferred label: Drug @en
type: Concept
narrower: لیزرژیک اسید دی‌اتیل‌آمید