ماده مخدر
preferred label: Drug @en
type: Concept
narrower: متادون

متادون
scope note: متادون یك شبه افیونی مصنوعی و به صورت پودر بلورین سفید است كه معمولا در یك نوشیدنی دارای اسانس میوه حل شده و روزی یكبار خورده می‌شود. متادون بیشتر برای كسانی كه بطور مرتب از مواد شبه افیونی مانند هروئین استفاده می‌كنند و كسانی كه آلوده به ویروس ایدز یا هپاتیت سی هستند تجویز می‌شود تا به تامین سلامت، ترك یا كاستن وابستگی آنها به مواد مخدر كمك كند و انتشار عفونت را از طریق استفاده از سوزن مشترك كاهش دهد. متادون برای تسكین دردهای شدید مزمن یا درد همراه با بیماریهای درمان‌ناپذیر بكار می‌رود.
broader: ماده مخدر
preferred label: Methadone @en
type: Concept