واخوردگی گردن (در تصادف)
scope note: صدمه وارده بر رباطها، مهره‌ها، ریشه‌های عصبی و مغز تیره در تلاقی‌گاه مهره‌های گردنی چهارم و پنجم و بر اثر حركت ناگهانی و شدید گردن به عقب كه مثلا در تصادف رانندگی یا هنگام ترمز گرفتن روی می‌دهد.
related: اختلال عضلانی- استخوانی
preferred label: Whiplash @en
type: Concept

اختلال عضلانی- استخوانی
preferred label: Musculoskeletal disorder @en
type: Concept
related: واخوردگی گردن (در تصادف)