برنامه درسی ملی
scope note: برنامه آموزشی تمام رشته‌ها یا درسهایی كه در سطح ملی یا مدارس دولتی ارائه می‌شود.
related: ملی
broader: برنامه آموزشی
preferred label: National curriculum @en
type: Concept

ملی
preferred label: National @en
type: Concept
related: برنامه درسی ملی

برنامه آموزشی
preferred label: Educational programme @en
type: Concept
narrower: برنامه درسی ملی