اثر
scope note: پدیدار یا حادثه‌ای كه به طور ثابت به دنبال یك پدیده معین دیگر می‌آید و در غیر آن صورت، پیدا نمی‌شود.
related: علیت
preferred label: Effect @en
type: Concept

علیت
preferred label: Causality @en
type: Concept
related: اثر