پژوهش
preferred label: Research @en
type: Concept
narrower: پژوهش طولی

پژوهش طولی
scope note: پژوهشی كه با پیگیری آزمودنی برای دوره‌های طولانی انجام می‌گیرد. در برابر روش مقطعی یا عرضی قرار دارد كه در آن، متغیرهای مشابهی در سنین مختلف، اما بر‌اساس آزمونهای متفاوت هر سن، مورد پژوهش قرار می‌گیرد.
broader: پژوهش
preferred label: Longitudinal research @en
type: Concept