پیش از بازنشستگی
scope note: وضعیت پیش از بازنشستگی و درآمد و امكانات مربوط به آن دوره كه معمولا با شرایط دوران بازنشستگی مقایسه می‌شود.
related: بازنشسته
broader: بازنشستگی
preferred label: Pre-retirement @en
type: Concept

بازنشسته
preferred label: Retired person @en
type: Concept
related: پیش از بازنشستگی

بازنشستگی
preferred label: Retirement @en
type: Concept
narrower: پیش از بازنشستگی