پیش از بازنشستگی
preferred label: Pre-retirement @en
type: Concept
broader: بازنشستگی

بازنشسته
preferred label: Retired person @en
type: Concept
related: بازنشستگی

بازنشستگی
scope note: پدیده حاصل از جوامع صنعتی كه در جدول رویدادهای زندگی هلمز- ریهی، معادل 45 واحد استرس و تقریبا برابر با اخراج از كار شمرده شده است. بازنشستگی به فرد مجال میدهد كه فرصت بیشتری از نظر اوقات فراغت داشته باشد. برای عده‌ای، بازنشستگی یك تجربه منفی است. ممكن است میزان وابستگی فرد را به دیگران افزایش دهد، بویژه اگر مشكلات مادی مطرح باشد یا فرد نتواند فعالیت یا علایقی پیدا كند كه به حفظ احترام به نفس او در حد یك شخص سازنده كمك كند.
narrower: پیش از بازنشستگی
related: بازنشسته
preferred label: Retirement @en
type: Concept