حساسیت
preferred label: Allergy @en
type: Concept
related: حساسیت به آمالگام

حساسیت به آمالگام
alternative label: حساسيت به ملغمه
scope note: حساسیت به پودر آلیاژی مورد استفاده در دندانپزشكی كه مركب از نقره، قلع، مقدار كمی مس و گاهی اندكی روی نیز در آن بكار رفته و در ابتدای تركیب به صورت خمیر نرم بوده و پس از مدتی سخت می‌شود.
related: حساسیت
related: اختلال بهداشت دهان
preferred label: Amalgam sensitivity @en
type: Concept

اختلال بهداشت دهان
preferred label: Oral health disorder @en
type: Concept
related: حساسیت به آمالگام