استعمال انفعالی دخانیات
alternative label: سيگار كشيدن بي‌اختياري
scope note: استنشاق دود دخانیات رها شده در فضا یا دود بازدم استعمال‌كنندگان دخانیات توسط دیگران. دود مستقیم ناشی از سوختن دخانیات كه آن را جریان جانبی می نامند، بیشتر از دود بازدم استعمال‌كنندگان دخانیات، مواد سمی و سرطانزا دارد.
broader: استعمال دخانیات
preferred label: Passive smoking @en
type: Concept

استعمال دخانیات
preferred label: Smoking @en
type: Concept
narrower: استعمال انفعالی دخانیات