گروه
preferred label: Group @en
type: Concept
narrower: گروه هدف

گروه هدف
alternative label: گروه آماج
scope note: گروهی كه قصد استنباط از آن در نظر باشد. این اصطلاح گاهی برای نشان دادن جمعیتی كه نمونه از آن گرفته شده و گاهی برای نشان دادن هر جمعیت مورد مطالعه كه استنباط در باره آن لازم باشد، به‌كار می‌رود.
related: گروه خطرزا
broader: گروه
preferred label: Target group @en
type: Concept

گروه خطرزا
preferred label: Risk group @en
type: Concept
related: گروه هدف