کربوهیدرات
alternative label: هيدرات‌كربن
scope note: تركیب آلی از كربن، هیدروژن و اكسیژن و مولد حرارت است و شامل نشاسته، قند و سلولز می‌شود.
related: فراورده غلات
broader: عنصر غذایی
preferred label: Carbohydrate @en
type: Concept

عنصر غذایی
preferred label: Nutritional component @en
type: Concept
narrower: کربوهیدرات

فراورده غلات
preferred label: Cereal product @en
type: Concept
related: کربوهیدرات