کلسترول
preferred label: Cholesterol @en
type: Concept
related: چربی

عنصر غذایی
preferred label: Nutritional component @en
type: Concept
narrower: چربی

چربی
scope note: لیپید نام علمی چربی است و شامل تری‌گلیسریدها، استرولها و سایر مواد چرب مانند كلسترول می‌شود.
related: کلسترول
broader: عنصر غذایی
preferred label: Lipid @en
type: Concept