سندرم فرسودگی
alternative label: فرسودگي رواني كوتاه مدت
scope note: از بین رفتن قوای روانی كه گاهی با افسردگی همراه است و از كوشش برای یاری به بیماران روانی یا اشخاص تحت فشار روانی ناشی می‌شود.
related: خستگی
related: فشار روانی
preferred label: Burnout syndrome @en
type: Concept

فشار روانی
preferred label: Stress @en
type: Concept
related: سندرم فرسودگی

خستگی
preferred label: Fatigue @en
type: Concept
related: سندرم فرسودگی