عنصر غذایی
preferred label: Nutritional component @en
type: Concept
related: کالری

کالری
scope note: واحد حرارت یا مقدار گرمایی كه یك كیلوگرم آب را از 15 درجه سانتیگراد به 16 درجه سانتیگراد برساند، و نیز واحدی است برای سنجش انرژی مصرفی یا واحد انرژی غذا. مانند اینكه میانگین انرژی مصرفی یك فرد برای گرم شدن یا كاركردن در حدود 3000 كالری است و این مقدار كالری مصرف شده باید به وسیله غذا و سوختن آن در بدن تامین شود.
related: عنصر غذایی
related: برنامه‌ریزی غذایی
preferred label: Calorie @en
type: Concept

برنامه‌ریزی غذایی
preferred label: Dieting @en
type: Concept
related: کالری