مهاجرت
preferred label: Migration @en
type: Concept
related: مشکل نسل دوم

انسجام اجتماعی
preferred label: Social integration @en
type: Concept
related: مشکل نسل دوم

مشکل نسل دوم
scope note: اشاره است به مسائل و مشكلات مربوط به فرزندان والدینی كه به كشور خاص مهاجرت كرده‌اند.
related: انسجام اجتماعی
related: مهاجرت
preferred label: Second generation problem @en
type: Concept