تغییر نگرشی
preferred label: Attitudinal change @en
type: Concept
related: خودتوانی

تغییر رفتاری
preferred label: Behavioural change @en
type: Concept
related: خودتوانی

خودتوانی
alternative label: كارايي شخصي
scope note: باورهای فرد در مورد توانایی برای كنار‌ آمدن با موقعیتهای گوناگون.
related: تغییر نگرشی
related: تغییر رفتاری
preferred label: Self efficacy @en
type: Concept